Reaction Details
TargetAlpha-1,6-mannosyl-glycoprotein 2-beta-N-acetylglucosaminyltransferase
LigandBDBM50433282
Substrate/Competitorn/a
Meas. Tech.ChEMBL_957858 (CHEMBL2378971)
IC50 1995±n/a nM
Citation Barlind, JGBuckett, LKCrosby, SGDavidsson, ÖEmtenäs, HErtan, AJurva, ULemurell, MGutierrez, PMNilsson, KO'Mahony, GPetersson, AURedzic, AWågberg, FYuan, ZQ Identification and design of a novel series of MGAT2 inhibitors. Bioorg Med Chem Lett23:2721-6 (2013) 
 
Alpha-1,6-mannosyl-glycoprotein 2-beta-N-acetylglucosaminyltransferase
Name:Alpha-1,6-mannosyl-glycoprotein 2-beta-N-acetylglucosaminyltransferase
Type:n/a
Mol. Mass.:51567.80
Organism:Homo sapiens (Human)
Description:Q10469
Residue:447
BDBM50433282
NameBDBM50433282
Synonyms:CHEMBL2376317
TypeSmall organic molecule
Emp. Form.C17H17ClN2O4S
Mol. Mass.380.846
SMILESCC1(C)COc2ccc(cc2C(=O)N1)S(=O)(=O)Nc1ccc(Cl)cc1