Reaction Details
TargetAlpha-1,6-mannosyl-glycoprotein 2-beta-N-acetylglucosaminyltransferase
LigandBDBM50433285
Substrate/Competitorn/a
Meas. Tech.ChEMBL_957858 (CHEMBL2378971)
IC50 3.2±n/a nM
Citation Barlind, JGBuckett, LKCrosby, SGDavidsson, ÖEmtenäs, HErtan, AJurva, ULemurell, MGutierrez, PMNilsson, KO'Mahony, GPetersson, AURedzic, AWågberg, FYuan, ZQ Identification and design of a novel series of MGAT2 inhibitors. Bioorg Med Chem Lett23:2721-6 (2013) 
 
Alpha-1,6-mannosyl-glycoprotein 2-beta-N-acetylglucosaminyltransferase
Name:Alpha-1,6-mannosyl-glycoprotein 2-beta-N-acetylglucosaminyltransferase
Type:n/a
Mol. Mass.:51567.80
Organism:Homo sapiens (Human)
Description:Q10469
Residue:447
BDBM50433285
NameBDBM50433285
Synonyms:CHEMBL2376310
TypeSmall organic molecule
Emp. Form.C19H19F2N3O4S
Mol. Mass.423.434
SMILESCCC1(CC)NC(=O)c2cc(ccc2NC1=O)S(=O)(=O)Nc1ccc(F)cc1F