Reaction Details
TargetAcyl-CoA wax alcohol acyltransferase 1
LigandBDBM50433273
Substrate/Competitorn/a
Meas. Tech.ChEMBL_957843 (CHEMBL2378918)
IC50>100000±n/a nM
Citation Barlind, JGBuckett, LKCrosby, SGDavidsson, ÖEmtenäs, HErtan, AJurva, ULemurell, MGutierrez, PMNilsson, KO'Mahony, GPetersson, AURedzic, AWågberg, FYuan, ZQ Identification and design of a novel series of MGAT2 inhibitors. Bioorg Med Chem Lett23:2721-6 (2013) 
 
Acyl-CoA wax alcohol acyltransferase 1
Name:Acyl-CoA wax alcohol acyltransferase 1
Type:PROTEIN
Mol. Mass.:37775.23
Organism:Homo sapiens (Human)
Description:ChEMBL_107585
Residue:328
BDBM50433273
NameBDBM50433273
Synonyms:CHEMBL2376322
TypeSmall organic molecule
Emp. Form.C18H19N3O4S
Mol. Mass.373.426
SMILESCCC1(C)NC(=O)c2cc(ccc2NC1=O)S(=O)(=O)Nc1ccccc1