Reaction Details
TargetLanosterol synthase
LigandBDBM50433365
Substrate/Competitorn/a
Meas. Tech.ChEMBL_956101 (CHEMBL2379126)
IC50>20000±n/a nM
Citation Lange, SKeller, MMüller, COliaro-Bosso, SBalliano, GBracher, F Aminopropylindenes derived from Grundmann's ketone as a novel chemotype of oxidosqualene cyclase inhibitors. Eur J Med Chem63:758-64 (2013) 
 
Lanosterol synthase
Name:Lanosterol synthase
Type:PROTEIN
Mol. Mass.:83309.32
Organism:Homo sapiens (Human)
Description:ChEMBL_11231
Residue:732
BDBM50433365
NameBDBM50433365
Synonyms:CHEMBL2377450
TypeSmall organic molecule
Emp. Form.C22H41N
Mol. Mass.319.5676
SMILESCNCCCC1=C2CC[C@H]([C@H](C)CCCC(C)C)[C@@]2(C)CCC1