Reaction Details
TargetGlucagon receptor
LigandBDBM100790
Substrate/Competitorn/a
Meas. Tech.ChEMBL_960258 (CHEMBL2382751)
Ki 1700±n/a nM
Citation Guzman-Perez, APfefferkorn, JALee, ECStevens, BDAspnes, GEBian, JDidiuk, MTFilipski, KJMoore, DPerreault, CSammons, MFTu, MBrown, JAtkinson, KLitchfield, JTan, BSamas, BZavadoski, WJSalatto, CTTreadway, J The design and synthesis of a potent glucagon receptor antagonist with favorable physicochemical and pharmacokinetic properties as a candidate for the treatment of type 2 diabetes mellitus. Bioorg Med Chem Lett23:3051-8 (2013) 
 
Glucagon receptor
Name:Glucagon receptor
Type:Enzyme
Mol. Mass.:54026.92
Organism:Homo sapiens (Human)
Description:P47871
Residue:477
BDBM100790
NameBDBM100790
Synonyms:US8507533, 28
TypeSmall organic molecule
Emp. Form.C23H24FN3O4
Mol. Mass.425.4528
SMILESCCCC(Oc1ccc(cc1)-n1cc(F)cn1)c1ccc(cc1)C(=O)NCCC(O)=O