Reaction Details
TargetGlucagon receptor
LigandBDBM50433590
Substrate/Competitorn/a
Meas. Tech.ChEMBL_960258 (CHEMBL2382751)
Ki 420±n/a nM
Citation Guzman-Perez, APfefferkorn, JALee, ECStevens, BDAspnes, GEBian, JDidiuk, MTFilipski, KJMoore, DPerreault, CSammons, MFTu, MBrown, JAtkinson, KLitchfield, JTan, BSamas, BZavadoski, WJSalatto, CTTreadway, J The design and synthesis of a potent glucagon receptor antagonist with favorable physicochemical and pharmacokinetic properties as a candidate for the treatment of type 2 diabetes mellitus. Bioorg Med Chem Lett23:3051-8 (2013) 
 
Glucagon receptor
Name:Glucagon receptor
Type:Enzyme
Mol. Mass.:54026.92
Organism:Homo sapiens (Human)
Description:P47871
Residue:477
BDBM50433590
NameBDBM50433590
Synonyms:CHEMBL2381833
TypeSmall organic molecule
Emp. Form.C26H26F3N3O4
Mol. Mass.501.4975
SMILESOC(=O)CCNC(=O)c1ccc(cc1)C(Oc1ccc(cc1)-n1cc(cn1)C(F)(F)F)C1CCCC1