Reaction Details
TargetGlucagon receptor
LigandBDBM50433597
Substrate/Competitorn/a
Meas. Tech.ChEMBL_960258 (CHEMBL2382751)
Ki 170±n/a nM
Citation Guzman-Perez, APfefferkorn, JALee, ECStevens, BDAspnes, GEBian, JDidiuk, MTFilipski, KJMoore, DPerreault, CSammons, MFTu, MBrown, JAtkinson, KLitchfield, JTan, BSamas, BZavadoski, WJSalatto, CTTreadway, J The design and synthesis of a potent glucagon receptor antagonist with favorable physicochemical and pharmacokinetic properties as a candidate for the treatment of type 2 diabetes mellitus. Bioorg Med Chem Lett23:3051-8 (2013) 
 
Glucagon receptor
Name:Glucagon receptor
Type:Enzyme
Mol. Mass.:54026.92
Organism:Homo sapiens (Human)
Description:P47871
Residue:477
BDBM50433597
NameBDBM50433597
Synonyms:CHEMBL2381822
TypeSmall organic molecule
Emp. Form.C23H24F3N5O3
Mol. Mass.475.4636
SMILESCCCC(Nc1ccc(nc1)-n1cc(cn1)C(F)(F)F)c1ccc(cc1)C(=O)NCCC(O)=O