Reaction Details
TargetTyrosine-protein kinase JAK2
LigandBDBM50433601
Substrate/Competitorn/a
Meas. Tech.ChEMBL_958063 (CHEMBL2383933)
Ki 1.4±n/a nM
Citation Guan, HLamb, MLPeng, BHuang, SDegrace, NRead, JHussain, SWu, JRivard, CAlimzhanov, MBebernitz, GBell, KYe, MZinda, MIoannidis, S Discovery of novel Jak2-Stat pathway inhibitors with extended residence time on target. Bioorg Med Chem Lett23:3105-10 (2013) 
 
Tyrosine-protein kinase JAK2
Name:Tyrosine-protein kinase JAK2
Type:Protein
Mol. Mass.:130684.68
Organism:Homo sapiens (Human)
Description:O60674
Residue:1132
BDBM50433601
NameBDBM50433601
Synonyms:CHEMBL2381983
TypeSmall organic molecule
Emp. Form.C19H21F3N8O
Mol. Mass.434.4182
SMILESC[C@H](Nc1nc(Nc2cc(C)n[nH]2)nc(N2CCOCC2)c1F)c1ncc(F)cc1F