Reaction Details
TargetTyrosine-protein kinase JAK2
LigandBDBM50433605
Substrate/Competitorn/a
Meas. Tech.ChEMBL_958068 (CHEMBL2383938)
IC50 3.0±n/a nM
Citation Guan, HLamb, MLPeng, BHuang, SDegrace, NRead, JHussain, SWu, JRivard, CAlimzhanov, MBebernitz, GBell, KYe, MZinda, MIoannidis, S Discovery of novel Jak2-Stat pathway inhibitors with extended residence time on target. Bioorg Med Chem Lett23:3105-10 (2013) 
 
Tyrosine-protein kinase JAK2
Name:Tyrosine-protein kinase JAK2
Type:Protein
Mol. Mass.:130684.68
Organism:Homo sapiens (Human)
Description:O60674
Residue:1132
BDBM50433605
NameBDBM50433605
Synonyms:CHEMBL2381975
TypeSmall organic molecule
Emp. Form.C20H25F2N9O2S
Mol. Mass.493.533
SMILESC[C@H](Nc1nc(Nc2cc(C)n[nH]2)nc(N2CCN(CC2)S(C)(=O)=O)c1F)c1ccc(F)cn1