Reaction Details
TargetPoly [ADP-ribose] polymerase 2
LigandBDBM50318567
Substrate/Competitorn/a
Meas. Tech.ChEMBL_958910 (CHEMBL2382488)
IC50 46±n/a nM
Citation Larsson, EAJansson, ANg, FMThen, SWPanicker, RLiu, BSangthongpitag, KPendharkar, VTai, SJHill, JDan, CHo, SYCheong, WWPoulsen, ABlanchard, SLin, GRAlam, JKeller, THNordlund, P Fragment-based ligand design of novel potent inhibitors of tankyrases. J Med Chem56:4497-508 (2013) 
 
Poly [ADP-ribose] polymerase 2
Name:Poly [ADP-ribose] polymerase 2
Type:Enzyme
Mol. Mass.:66225.70
Organism:Homo sapiens (Human)
Description:Q9UGN5
Residue:583
BDBM50318567
NameBDBM50318567
Synonyms:2-(4-(Trifluoromethyl)phenyl)-7,8-dihydro-5H-thiopyrano-[4,3-d]pyrimidin-4-ol CHEMBL1086580
TypeSmall organic molecule
Emp. Form.C14H11F3N2OS
Mol. Mass.312.31
SMILESFC(F)(F)c1ccc(cc1)-c1nc2CCSCc2c(=O)[nH]1