Reaction Details
TargetMacrophage metalloelastase
LigandBDBM50434213
Substrate/Competitorn/a
Meas. Tech.ChEMBL_960929 (CHEMBL2388547)
Ki 5.0±n/a nM
Citation Mori, MMassaro, ACalderone, VFragai, MLuchinat, CMordini, A Discovery of a New Class of Potent MMP Inhibitors by Structure-Based Optimization of the Arylsulfonamide Scaffold. ACS Med Chem Lett4:565-9 (2013) 
 
Macrophage metalloelastase
Name:Macrophage metalloelastase
Type:Enzyme
Mol. Mass.:54012.99
Organism:Homo sapiens (Human)
Description:P39900
Residue:470
BDBM50434213
NameBDBM50434213
Synonyms:CHEMBL2385489
TypeSmall organic molecule
Emp. Form.C14H18N2O6S
Mol. Mass.342.368
SMILESONC(=O)[C@@H]1CCCN1S(=O)(=O)CCc1ccc2OCOc2c1