Reaction Details
TargetDual specificity tyrosine-phosphorylation-regulated kinase 1A
LigandBDBM50434351
Substrate/Competitorn/a
Meas. Tech.ChEMBL_961005 (CHEMBL2388921)
IC50 4.9±n/a nM
Citation Rosse, G Tricyclic Pyrimidines As Inhibitors of DYRK1A/DYRK1B As Potential Treatment for Down's Syndrome or Alzheimer's Disease. ACS Med Chem Lett4:502-3 (2013) 
 
Dual specificity tyrosine-phosphorylation-regulated kinase 1A
Name:Dual specificity tyrosine-phosphorylation-regulated kinase 1A
Type:Enzyme
Mol. Mass.:85616.61
Organism:Homo sapiens (Human)
Description:Q13627
Residue:763
BDBM50434351
NameBDBM50434351
Synonyms:CHEMBL2386749 | US9446044, 60
TypeSmall organic molecule
Emp. Form.C17H12N6O4S
Mol. Mass.396.38
SMILESCOC(=N)c1nc2ccc3ncnc(Nc4ccc(O)c(c4)[N+]([O-])=O)c3c2s1