Reaction Details
TargetCytochrome P450 2D6
LigandBDBM50434681
Substrate/Competitorn/a
Meas. Tech.ChEMBL_961189 (CHEMBL2389925)
IC50>30000±n/a nM
Citation Shiro, TKakiguchi, KTakahashi, HNagata, HTobe, M 7-Phenyl-imidazoquinolin-4(5H)-one derivatives as selective and orally available mPGES-1 inhibitors. Bioorg Med Chem21:2868-78 (2013) 
 
Cytochrome P450 2D6
Name:Cytochrome P450 2D6
Type:Protein
Mol. Mass.:55774.82
Organism:Homo sapiens (Human)
Description:P10635
Residue:497
BDBM50434681
NameBDBM50434681
Synonyms:CHEMBL2387603
TypeSmall organic molecule
Emp. Form.C20H12ClN3OS
Mol. Mass.377.847
SMILESClc1ccccc1-c1nc2c([nH]1)c(=O)[nH]c1cc(ccc21)-c1cccs1