Reaction Details
TargetCytochrome P450 2C19
LigandBDBM50434668
Substrate/Competitorn/a
Meas. Tech.ChEMBL_961190 (CHEMBL2389926)
IC50>30000±n/a nM
Citation Shiro, TKakiguchi, KTakahashi, HNagata, HTobe, M 7-Phenyl-imidazoquinolin-4(5H)-one derivatives as selective and orally available mPGES-1 inhibitors. Bioorg Med Chem21:2868-78 (2013) 
 
Cytochrome P450 2C19
Name:Cytochrome P450 2C19
Type:Enzyme
Mol. Mass.:55935.47
Organism:Homo sapiens (Human)
Description:P33261
Residue:490
BDBM50434668
NameBDBM50434668
Synonyms:CHEMBL2387503
TypeSmall organic molecule
Emp. Form.C22H13ClFN3O
Mol. Mass.389.81
SMILESFc1cccc(Cl)c1-c1nc2c([nH]1)c(=O)[nH]c1cc(ccc21)-c1ccccc1