Reaction Details
TargetCytochrome P450 2C9
LigandBDBM50434675
Substrate/Competitorn/a
Meas. Tech.ChEMBL_961191 (CHEMBL2389927)
IC50 20000±n/a nM
Citation Shiro, TKakiguchi, KTakahashi, HNagata, HTobe, M 7-Phenyl-imidazoquinolin-4(5H)-one derivatives as selective and orally available mPGES-1 inhibitors. Bioorg Med Chem21:2868-78 (2013) 
 
Cytochrome P450 2C9
Name:Cytochrome P450 2C9
Type:Enzyme
Mol. Mass.:55636.33
Organism:Homo sapiens (Human)
Description:P11712
Residue:490
BDBM50434675
NameBDBM50434675
Synonyms:CHEMBL2387502
TypeSmall organic molecule
Emp. Form.C22H13ClN4O3
Mol. Mass.416.817
SMILES[O-][N+](=O)c1cccc(Cl)c1-c1nc2c([nH]1)c(=O)[nH]c1cc(ccc21)-c1ccccc1