Reaction Details
TargetCytochrome P450 2C9
LigandBDBM50434694
Substrate/Competitorn/a
Meas. Tech.ChEMBL_961191 (CHEMBL2389927)
IC50>30000±n/a nM
Citation Shiro, TKakiguchi, KTakahashi, HNagata, HTobe, M 7-Phenyl-imidazoquinolin-4(5H)-one derivatives as selective and orally available mPGES-1 inhibitors. Bioorg Med Chem21:2868-78 (2013) 
 
Cytochrome P450 2C9
Name:Cytochrome P450 2C9
Type:Enzyme
Mol. Mass.:55636.33
Organism:Homo sapiens (Human)
Description:P11712
Residue:490
BDBM50434694
NameBDBM50434694
Synonyms:CHEMBL2387590
TypeSmall organic molecule
Emp. Form.C16H9Cl2N3O
Mol. Mass.330.168
SMILESClc1ccc2c3nc([nH]c3c(=O)[nH]c2c1)-c1ccccc1Cl