Reaction Details
TargetCytochrome P450 2C9
LigandBDBM50360832
Substrate/Competitorn/a
Meas. Tech.ChEMBL_961191 (CHEMBL2389927)
IC50 700±n/a nM
Citation Shiro, TKakiguchi, KTakahashi, HNagata, HTobe, M 7-Phenyl-imidazoquinolin-4(5H)-one derivatives as selective and orally available mPGES-1 inhibitors. Bioorg Med Chem21:2868-78 (2013) 
 
Cytochrome P450 2C9
Name:Cytochrome P450 2C9
Type:Enzyme
Mol. Mass.:55636.33
Organism:Homo sapiens (Human)
Description:P11712
Residue:490
BDBM50360832
NameBDBM50360832
Synonyms:CHEMBL1934810
TypeSmall organic molecule
Emp. Form.C16H9BrClN3O
Mol. Mass.374.619
SMILESClc1ccccc1-c1nc2c([nH]1)c(=O)[nH]c1cc(Br)ccc21