Reaction Details
TargetProstaglandin E synthase
LigandBDBM50434692
Substrate/Competitorn/a
Meas. Tech.ChEMBL_961192 (CHEMBL2389928)
IC50 434±n/a nM
Citation Shiro, TKakiguchi, KTakahashi, HNagata, HTobe, M 7-Phenyl-imidazoquinolin-4(5H)-one derivatives as selective and orally available mPGES-1 inhibitors. Bioorg Med Chem21:2868-78 (2013) 
 
Prostaglandin E synthase
Name:Prostaglandin E synthase
Type:Protein
Mol. Mass.:17112.22
Organism:Homo sapiens (Human)
Description:n/a
Residue:152
BDBM50434692
NameBDBM50434692
Synonyms:CHEMBL2387592
TypeSmall organic molecule
Emp. Form.C16H9Cl2N3O
Mol. Mass.330.168
SMILESClc1ccc2[nH]c(=O)c3[nH]c(nc3c2c1)-c1ccccc1Cl