Reaction Details
TargetProstaglandin E synthase
LigandBDBM50434691
Substrate/Competitorn/a
Meas. Tech.ChEMBL_961192 (CHEMBL2389928)
IC50 241±n/a nM
Citation Shiro, TKakiguchi, KTakahashi, HNagata, HTobe, M 7-Phenyl-imidazoquinolin-4(5H)-one derivatives as selective and orally available mPGES-1 inhibitors. Bioorg Med Chem21:2868-78 (2013) 
 
Prostaglandin E synthase
Name:Prostaglandin E synthase
Type:Protein
Mol. Mass.:17112.22
Organism:Homo sapiens (Human)
Description:n/a
Residue:152
BDBM50434691
NameBDBM50434691
Synonyms:CHEMBL2387593
TypeSmall organic molecule
Emp. Form.C17H12ClN3O
Mol. Mass.309.75
SMILESCc1ccc2c3nc([nH]c3c(=O)[nH]c2c1)-c1ccccc1Cl