Reaction Details
TargetProstaglandin E synthase
LigandBDBM50434676
Substrate/Competitorn/a
Meas. Tech.ChEMBL_961192 (CHEMBL2389928)
IC50 12±n/a nM
Citation Shiro, TKakiguchi, KTakahashi, HNagata, HTobe, M 7-Phenyl-imidazoquinolin-4(5H)-one derivatives as selective and orally available mPGES-1 inhibitors. Bioorg Med Chem21:2868-78 (2013) 
 
Prostaglandin E synthase
Name:Prostaglandin E synthase
Type:Protein
Mol. Mass.:17112.22
Organism:Homo sapiens (Human)
Description:n/a
Residue:152
BDBM50434676
NameBDBM50434676
Synonyms:CHEMBL2387501
TypeSmall organic molecule
Emp. Form.C23H13ClF3N3O
Mol. Mass.439.817
SMILESFC(F)(F)c1cccc(Cl)c1-c1nc2c([nH]1)c(=O)[nH]c1cc(ccc21)-c1ccccc1