Reaction Details
TargetProstaglandin E synthase
LigandBDBM50434674
Substrate/Competitorn/a
Meas. Tech.ChEMBL_961192 (CHEMBL2389928)
IC50 9.9±n/a nM
Citation Shiro, TKakiguchi, KTakahashi, HNagata, HTobe, M 7-Phenyl-imidazoquinolin-4(5H)-one derivatives as selective and orally available mPGES-1 inhibitors. Bioorg Med Chem21:2868-78 (2013) 
 
Prostaglandin E synthase
Name:Prostaglandin E synthase
Type:Protein
Mol. Mass.:17112.22
Organism:Homo sapiens (Human)
Description:n/a
Residue:152
BDBM50434674
NameBDBM50434674
Synonyms:CHEMBL2387504
TypeSmall organic molecule
Emp. Form.C23H15ClFN3O
Mol. Mass.403.836
SMILESCc1ccccc1-c1ccc2c3nc([nH]c3c(=O)[nH]c2c1)-c1c(F)cccc1Cl