Reaction Details
TargetTyrosine-protein kinase JAK2
LigandBDBM50434821
Substrate/Competitorn/a
Meas. Tech.ChEMBL_962880 (CHEMBL2389428)
Ki 28±n/a nM
Citation Liang, Jvan Abbema, ABalazs, MBarrett, KBerezhkovsky, LBlair, WChang, CDelarosa, DDeVoss, JDriscoll, JEigenbrot, CGhilardi, NGibbons, PHalladay, JJohnson, AKohli, PBLai, YLiu, YLyssikatos, JMantik, PMenghrajani, KMurray, JPeng, ISambrone, AShia, SShin, YSmith, JSohn, STsui, VUltsch, MWu, LCXiao, YYang, WYoung, JZhang, BZhu, BYMagnuson, S Lead optimization of a 4-aminopyridine benzamide scaffold to identify potent, selective, and orally bioavailable TYK2 inhibitors. J Med Chem56:4521-36 (2013) 
 
Tyrosine-protein kinase JAK2
Name:Tyrosine-protein kinase JAK2
Type:Protein
Mol. Mass.:130684.68
Organism:Homo sapiens (Human)
Description:O60674
Residue:1132
BDBM50434821
NameBDBM50434821
Synonyms:CHEMBL2387224
TypeSmall organic molecule
Emp. Form.C16H13Cl2N3O2
Mol. Mass.350.199
SMILESClc1cccc(Cl)c1C(=O)Nc1ccnc(NC(=O)C2CC2)c1