Reaction Details
TargetTransient receptor potential cation channel subfamily V member 1
LigandBDBM50434924
Substrate/Competitorn/a
Meas. Tech.ChEMBL_960513 (CHEMBL2389488)
pH6±n/a
IC50 29±n/a nM
Commentsextracted
Citation Thorat, SAKang, DWRyu, HKim, MSKim, HSAnn, JHa, TKim, SESon, KChoi, SBlumberg, PMFrank, RBahrenberg, GSchiene, KChristoph, TLee, J 2-(3-Fluoro-4-methylsulfonylaminophenyl)propanamides as potent TRPV1 antagonists: structure activity relationships of the 2-oxy pyridine C-region. Eur J Med Chem64:589-602 (2013) 
 
Transient receptor potential cation channel subfamily V member 1
Name:Transient receptor potential cation channel subfamily V member 1
Type:Protein
Mol. Mass.:94960.75
Organism:Homo sapiens (Human)
Description:Q8NER1
Residue:839
BDBM50434924
NameBDBM50434924
Synonyms:CHEMBL2385416
TypeSmall organic molecule
Emp. Form.C22H25F4N3O4S
Mol. Mass.503.51
SMILESCC(C(=O)NCc1ccc(nc1OC1CCCC1)C(F)(F)F)c1ccc(NS(C)(=O)=O)c(F)c1