Reaction Details
TargetTransient receptor potential cation channel subfamily V member 1
LigandBDBM50434952
Substrate/Competitorn/a
Meas. Tech.ChEMBL_960514 (CHEMBL2389489)
Ki 0.700000±n/a nM
Citation Thorat, SAKang, DWRyu, HKim, MSKim, HSAnn, JHa, TKim, SESon, KChoi, SBlumberg, PMFrank, RBahrenberg, GSchiene, KChristoph, TLee, J 2-(3-Fluoro-4-methylsulfonylaminophenyl)propanamides as potent TRPV1 antagonists: structure activity relationships of the 2-oxy pyridine C-region. Eur J Med Chem64:589-602 (2013) 
 
Transient receptor potential cation channel subfamily V member 1
Name:Transient receptor potential cation channel subfamily V member 1
Type:Protein
Mol. Mass.:94960.75
Organism:Homo sapiens (Human)
Description:Q8NER1
Residue:839
BDBM50434952
NameBDBM50434952
Synonyms:CHEMBL2385238
TypeSmall organic molecule
Emp. Form.C26H27F4N3O6S
Mol. Mass.585.568
SMILESCOc1cc(COc2nc(ccc2CNC(=O)C(C)c2ccc(NS(C)(=O)=O)c(F)c2)C(F)(F)F)cc(OC)c1