Reaction Details
TargetTransient receptor potential cation channel subfamily V member 1
LigandBDBM50385656
Substrate/Competitorn/a
Meas. Tech.ChEMBL_960514 (CHEMBL2389489)
Ki 45±n/a nM
Citation Thorat, SAKang, DWRyu, HKim, MSKim, HSAnn, JHa, TKim, SESon, KChoi, SBlumberg, PMFrank, RBahrenberg, GSchiene, KChristoph, TLee, J 2-(3-Fluoro-4-methylsulfonylaminophenyl)propanamides as potent TRPV1 antagonists: structure activity relationships of the 2-oxy pyridine C-region. Eur J Med Chem64:589-602 (2013) 
 
Transient receptor potential cation channel subfamily V member 1
Name:Transient receptor potential cation channel subfamily V member 1
Type:Protein
Mol. Mass.:94960.75
Organism:Homo sapiens (Human)
Description:Q8NER1
Residue:839
BDBM50385656
NameBDBM50385656
Synonyms:CHEMBL2042264
TypeSmall organic molecule
Emp. Form.C21H27FN2O3S
Mol. Mass.406.514
SMILESCC(C(=O)NCc1ccc(cc1)C(C)(C)C)c1ccc(NS(C)(=O)=O)c(F)c1