Reaction Details
TargetQuinolone resistance protein NorA
LigandBDBM50434963
Substrate/Competitorn/a
Meas. Tech.ChEMBL_961221 (CHEMBL2390113)
IC50 9700±n/a nM
Citation Sabatini, SGosetto, FIraci, NBarreca, MLMassari, SSancineto, LManfroni, GTabarrini, ODimovska, MKaatz, GWCecchetti, V Re-evolution of the 2-phenylquinolines: ligand-based design, synthesis, and biological evaluation of a potent new class of Staphylococcus aureus NorA efflux pump inhibitors to combat antimicrobial resistance. J Med Chem56:4975-89 (2013) 
 
Quinolone resistance protein NorA
Name:Quinolone resistance protein NorA
Type:PROTEIN
Mol. Mass.:42273.03
Organism:Staphylococcus aureus
Description:ChEMBL_961221
Residue:388
BDBM50434963
NameBDBM50434963
Synonyms:CHEMBL2385689
TypeSmall organic molecule
Emp. Form.C25H31N3O2
Mol. Mass.405.5325
SMILESCCCOc1ccc(cc1)-c1cc(OCCN2CCN(C)CC2)c2ccccc2n1