Reaction Details
TargetProstaglandin E synthase
LigandBDBM50435048
Substrate/Competitorn/a
Meas. Tech.ChEMBL_964545 (CHEMBL2393812)
IC50 53±n/a nM
Citation Arhancet, GBWalker, DPMetz, SFobian, YMHeasley, SECarter, JSSpringer, JRJones, DEHayes, MJShaffer, AFJerome, GMBaratta, MTZweifel, BMoore, WMMasferrer, JLVazquez, ML Discovery and SAR of PF-4693627, a potent, selective and orally bioavailable mPGES-1 inhibitor for the potential treatment of inflammation. Bioorg Med Chem Lett23:1114-9 (2013) 
 
Prostaglandin E synthase
Name:Prostaglandin E synthase
Type:Protein
Mol. Mass.:17112.22
Organism:Homo sapiens (Human)
Description:n/a
Residue:152
BDBM50435048
NameBDBM50435048
Synonyms:CHEMBL2391142
TypeSmall organic molecule
Emp. Form.C27H29ClF3N3O4
Mol. Mass.551.985
SMILESOC[C@H]1CCC[C@@H](C1)NC(=O)C1CCN(CC1)c1nc2cc(Cl)c(cc2o1)-c1ccc(OC(F)(F)F)cc1