Reaction Details
TargetATP-dependent translocase ABCB1
LigandBDBM50001839
Substrate/Competitorn/a
Meas. Tech.ChEMBL_965057 (CHEMBL2396369)
IC50 2596±n/a nM
Citation Gangjee, AZaware, NDevambatla, RKRaghavan, SWestbrook, CDDybdal-Hargreaves, NFHamel, EMooberry, SL Synthesis of N(4)-(substituted phenyl)-N(4)-alkyl/desalkyl-9H-pyrimido[4,5-b]indole-2,4-diamines and identification of new microtubule disrupting compounds that are effective against multidrug resistant cells. Bioorg Med Chem21:891-902 (2013) 
 
ATP-dependent translocase ABCB1
Name:ATP-dependent translocase ABCB1
Type:Protein
Mol. Mass.:141503.50
Organism:Homo sapiens (Human)
Description:P08183
Residue:1280
BDBM50001839
NameBDBM50001839
Synonyms:CHEMBL428647 taxol
TypeSmall organic molecule
Emp. Form.C47H51NO14
Mol. Mass.853.9061
SMILESCC(=O)O[C@@H]1C2=C(C)[C@H](C[C@@](O)([C@@H](OC(=O)c3ccccc3)[C@@H]3[C@@]4(CO[C@@H]4C[C@H](O)[C@@]3(C)C1=O)OC(C)=O)C2(C)C)OC(=O)[C@H](O)[C@@H](NC(=O)c1ccccc1)c1ccccc1