Reaction Details
TargetPlatelet-activating factor receptor
LigandBDBM85035
Substrate/Competitorn/a
Meas. Tech.ChEMBL_965439 (CHEMBL2395085)
Ki 0.150000±n/a nM
Citation Germain, ARCarmody, LCNag, PPMorgan, BVerplank, LFernandez, CDonckele, EFeng, YPerez, JRDandapani, SPalmer, MLander, ESGupta, PBSchreiber, SLMunoz, B Cinnamides as selective small-molecule inhibitors of a cellular model of breast cancer stem cells. Bioorg Med Chem Lett23:1834-8 (2013) 
 
Platelet-activating factor receptor
Name:Platelet-activating factor receptor
Type:Enzyme Catalytic Domain
Mol. Mass.:39219.60
Organism:Homo sapiens (Human)
Description:PAF Platelet activating factor PTAFR HUMAN::P25105
Residue:342
BDBM85035
NameBDBM85035
Synonyms:CAS_65154-06-5 bloodplatelet-activatingfactor
TypeSmall organic molecule
Emp. Form.C26H54NO7P
Mol. Mass.523.6832
[C@H](COP([O-])(=O)OCC[N+](C)(C)C)OC(C)=O