Reaction Details
TargetSubstance-P receptor
LigandBDBM50435126
Substrate/Competitorn/a
Meas. Tech.ChEMBL_965304 (CHEMBL2394497)
IC50 3.6±n/a nM
Citation Germain, ARCarmody, LCNag, PPMorgan, BVerplank, LFernandez, CDonckele, EFeng, YPerez, JRDandapani, SPalmer, MLander, ESGupta, PBSchreiber, SLMunoz, B Cinnamides as selective small-molecule inhibitors of a cellular model of breast cancer stem cells. Bioorg Med Chem Lett23:1834-8 (2013) 
 
Substance-P receptor
Name:Substance-P receptor
Type:G Protein-Coupled Receptor (GPCR)
Mol. Mass.:46254.43
Organism:Homo sapiens (Human)
Description:P25103
Residue:407
BDBM50435126
NameBDBM50435126
Synonyms:CHEMBL2392023
TypeSmall organic molecule
Emp. Form.C26H27IN2
Mol. Mass.494.4105
SMILESIc1ccccc1N[C@@H]1C2CCN(CC2)[C@@H]1C(c1ccccc1)c1ccccc1