Reaction Details
TargetDual specificity protein kinase CLK4
LigandBDBM50435425
Substrate/Competitorn/a
Meas. Tech.ChEMBL_965912 (CHEMBL2394343)
IC50 13±n/a nM
Citation Coombs, TCTanega, CShen, MWang, JLAuld, DSGerritz, SWSchoenen, FJThomas, CJAubé, J Small-molecule pyrimidine inhibitors of the cdc2-like (Clk) and dual specificity tyrosine phosphorylation-regulated (Dyrk) kinases: development of chemical probe ML315. Bioorg Med Chem Lett23:3654-61 (2013) 
 
Dual specificity protein kinase CLK4
Name:Dual specificity protein kinase CLK4
Type:Serine/threonine-protein kinase
Mol. Mass.:57522.53
Organism:Homo sapiens (Human)
Description:gi_10190706
Residue:481
BDBM50435425
NameBDBM50435425
Synonyms:CHEMBL1904905
TypeSmall organic molecule
Emp. Form.C19H15Cl2N3O2
Mol. Mass.388.247
SMILESClc1ccc(CNc2nccc(n2)-c2ccc3OCCOc3c2)cc1Cl