Reaction Details
TargetDual specificity tyrosine-phosphorylation-regulated kinase 1A
LigandBDBM50435449
Substrate/Competitorn/a
Meas. Tech.ChEMBL_965915 (CHEMBL2394346)
IC50 50±n/a nM
Citation Coombs, TCTanega, CShen, MWang, JLAuld, DSGerritz, SWSchoenen, FJThomas, CJAubé, J Small-molecule pyrimidine inhibitors of the cdc2-like (Clk) and dual specificity tyrosine phosphorylation-regulated (Dyrk) kinases: development of chemical probe ML315. Bioorg Med Chem Lett23:3654-61 (2013) 
 
Dual specificity tyrosine-phosphorylation-regulated kinase 1A
Name:Dual specificity tyrosine-phosphorylation-regulated kinase 1A
Type:Enzyme
Mol. Mass.:85616.61
Organism:Homo sapiens (Human)
Description:Q13627
Residue:763
BDBM50435449
NameBDBM50435449
Synonyms:CHEMBL2392364
TypeSmall organic molecule
Emp. Form.C18H13Cl2N3O2
Mol. Mass.374.221
SMILESClc1cc(Cl)cc(CNc2nccc(n2)-c2ccc3OCOc3c2)c1