Reaction Details
TargetDual specificity protein kinase CLK4
LigandBDBM50435436
Substrate/Competitorn/a
Meas. Tech.ChEMBL_965916 (CHEMBL2394347)
IC50 40±n/a nM
Citation Coombs, TCTanega, CShen, MWang, JLAuld, DSGerritz, SWSchoenen, FJThomas, CJAubé, J Small-molecule pyrimidine inhibitors of the cdc2-like (Clk) and dual specificity tyrosine phosphorylation-regulated (Dyrk) kinases: development of chemical probe ML315. Bioorg Med Chem Lett23:3654-61 (2013) 
 
Dual specificity protein kinase CLK4
Name:Dual specificity protein kinase CLK4
Type:Serine/threonine-protein kinase
Mol. Mass.:57522.53
Organism:Homo sapiens (Human)
Description:gi_10190706
Residue:481
BDBM50435436
NameBDBM50435436
Synonyms:CHEMBL2392365
TypeSmall organic molecule
Emp. Form.C18H13Br2N3O2
Mol. Mass.463.123
SMILESBrc1cc(Br)cc(CNc2nccc(n2)-c2ccc3OCOc3c2)c1