Reaction Details
TargetGlutaminyl-peptide cyclotransferase
LigandBDBM50435558
Substrate/Competitorn/a
Meas. Tech.ChEMBL_966260 (CHEMBL2395921)
IC50 208±n/a nM
Citation Tran, PTHoang, VHThorat, SAKim, SEAnn, JChang, YJNam, DWSong, HMook-Jung, ILee, JLee, J Structure-activity relationship of human glutaminyl cyclase inhibitors having an N-(5-methyl-1H-imidazol-1-yl)propyl thiourea template. Bioorg Med Chem21:3821-30 (2013) 
 
Glutaminyl-peptide cyclotransferase
Name:Glutaminyl-peptide cyclotransferase
Type:Enzyme
Mol. Mass.:40877.05
Organism:Homo sapiens (Human)
Description:Q16769
Residue:361
BDBM50435558
NameBDBM50435558
Synonyms:CHEMBL2392814
TypeSmall organic molecule
Emp. Form.C17H22N4OS
Mol. Mass.330.448
SMILESCc1cncn1CCCNC(=S)Nc1ccc2OCCCc2c1