Reaction Details
TargetAurora kinase B
LigandBDBM50435694
Substrate/Competitorn/a
Meas. Tech.ChEMBL_965037 (CHEMBL2396199)
IC50 2.2±n/a nM
Citation Zheng, YZheng, MLing, XLiu, YXue, YAn, LGu, NJi, MJin, M Design, synthesis, quantum chemical studies and biological activity evaluation of pyrazole-benzimidazole derivatives as potent Aurora A/B kinase inhibitors. Bioorg Med Chem Lett23:3523-30 (2013) 
 
Aurora kinase B
Name:Aurora kinase B
Type:Protein
Mol. Mass.:39327.72
Organism:Homo sapiens (Human)
Description:Q96GD4
Residue:344
BDBM50435694
NameBDBM50435694
Synonyms:CHEMBL2392111
TypeSmall organic molecule
Emp. Form.C20H21ClN8O3S
Mol. Mass.488.951
SMILESCS(=O)(=O)c1nc(Cl)cc(Nc2c[nH]nc2-c2nc3ccc(CN4CCOCC4)cc3[nH]2)n1