Reaction Details
TargetAurora kinase B
LigandBDBM50435698
Substrate/Competitorn/a
Meas. Tech.ChEMBL_965037 (CHEMBL2396199)
IC50 231±n/a nM
Citation Zheng, YZheng, MLing, XLiu, YXue, YAn, LGu, NJi, MJin, M Design, synthesis, quantum chemical studies and biological activity evaluation of pyrazole-benzimidazole derivatives as potent Aurora A/B kinase inhibitors. Bioorg Med Chem Lett23:3523-30 (2013) 
 
Aurora kinase B
Name:Aurora kinase B
Type:Protein
Mol. Mass.:39327.72
Organism:Homo sapiens (Human)
Description:Q96GD4
Residue:344
BDBM50435698
NameBDBM50435698
Synonyms:CHEMBL2392106
TypeSmall organic molecule
Emp. Form.C16H14ClN7S
Mol. Mass.371.847
SMILESCSc1nc(Cl)cc(Nc2c[nH]nc2-c2nc3ccc(C)cc3[nH]2)n1