Reaction Details
TargetAurora kinase B
LigandBDBM50435701
Substrate/Competitorn/a
Meas. Tech.ChEMBL_965037 (CHEMBL2396199)
IC50 412±n/a nM
Citation Zheng, YZheng, MLing, XLiu, YXue, YAn, LGu, NJi, MJin, M Design, synthesis, quantum chemical studies and biological activity evaluation of pyrazole-benzimidazole derivatives as potent Aurora A/B kinase inhibitors. Bioorg Med Chem Lett23:3523-30 (2013) 
 
Aurora kinase B
Name:Aurora kinase B
Type:Protein
Mol. Mass.:39327.72
Organism:Homo sapiens (Human)
Description:Q96GD4
Residue:344
BDBM50435701
NameBDBM50435701
Synonyms:CHEMBL2392103
TypeSmall organic molecule
Emp. Form.C29H28ClN9O2S
Mol. Mass.602.11
SMILESClc1cc(Nc2c[nH]nc2-c2nc3ccc(CN4CCOCC4)cc3[nH]2)nc(Sc2ccc(NC(=O)C3CC3)cc2)n1