Reaction Details
TargetAurora kinase A
LigandBDBM50435694
Substrate/Competitorn/a
Meas. Tech.ChEMBL_965038 (CHEMBL2396200)
IC50 29±n/a nM
Citation Zheng, YZheng, MLing, XLiu, YXue, YAn, LGu, NJi, MJin, M Design, synthesis, quantum chemical studies and biological activity evaluation of pyrazole-benzimidazole derivatives as potent Aurora A/B kinase inhibitors. Bioorg Med Chem Lett23:3523-30 (2013) 
 
Aurora kinase A
Name:Aurora kinase A
Type:Serine/threonine-protein kinase
Mol. Mass.:45830.98
Organism:Homo sapiens (Human)
Description:O14965
Residue:403
BDBM50435694
NameBDBM50435694
Synonyms:CHEMBL2392111
TypeSmall organic molecule
Emp. Form.C20H21ClN8O3S
Mol. Mass.488.951
SMILESCS(=O)(=O)c1nc(Cl)cc(Nc2c[nH]nc2-c2nc3ccc(CN4CCOCC4)cc3[nH]2)n1