Reaction Details
TargetSterol O-acyltransferase 2
LigandBDBM50436342
Substrate/Competitorn/a
Meas. Tech.ChEMBL_966605 (CHEMBL2399639)
IC50 9.0±n/a nM
Citation Ohtawa, MYamazaki, HOhte, SMatsuda, DOhshiro, TRudel, LLOmura, STomoda, HNagamitsu, T Synthesis and structure-activity relationship of pyripyropene A derivatives as potent and selective acyl-CoA:cholesterol acyltransferase 2 (ACAT2) inhibitors: part 3. Bioorg Med Chem Lett23:3798-801 (2013) 
 
Sterol O-acyltransferase 2
Name:Sterol O-acyltransferase 2
Type:Enzyme
Mol. Mass.:59912.75
Organism:Homo sapiens (Human)
Description:O75908
Residue:522
BDBM50436342
NameBDBM50436342
Synonyms:CHEMBL2398817
TypeSmall organic molecule
Emp. Form.C39H38ClNO8
Mol. Mass.684.174
SMILESC[C@@]12CO[C@H](O[C@H]1CC[C@@]1(C)[C@H]2C[C@H](OC(=O)c2ccc(Cl)cc2)[C@@]2(C)Oc3cc(oc(=O)c3[C@H](O)[C@H]12)-c1cccnc1)c1ccccc1