Reaction Details
TargetSterol O-acyltransferase 1
LigandBDBM50436341
Substrate/Competitorn/a
Meas. Tech.ChEMBL_966604 (CHEMBL2399638)
IC50 6900±n/a nM
Citation Ohtawa, MYamazaki, HOhte, SMatsuda, DOhshiro, TRudel, LLOmura, STomoda, HNagamitsu, T Synthesis and structure-activity relationship of pyripyropene A derivatives as potent and selective acyl-CoA:cholesterol acyltransferase 2 (ACAT2) inhibitors: part 3. Bioorg Med Chem Lett23:3798-801 (2013) 
 
Sterol O-acyltransferase 1
Name:Sterol O-acyltransferase 1
Type:Multi-pass membrane protein may form homo- or heterodimers.
Mol. Mass.:64751.94
Organism:Homo sapiens (Human)
Description:P35610
Residue:550
BDBM50436341
NameBDBM50436341
Synonyms:CHEMBL2398818
TypeSmall organic molecule
Emp. Form.C39H38BrNO8
Mol. Mass.728.625
SMILESC[C@@]12CO[C@H](O[C@H]1CC[C@@]1(C)[C@H]2C[C@H](OC(=O)c2ccc(Br)cc2)[C@@]2(C)Oc3cc(oc(=O)c3[C@H](O)[C@H]12)-c1cccnc1)c1ccccc1