Reaction Details
TargetSterol O-acyltransferase 2
LigandBDBM50429604
Substrate/Competitorn/a
Meas. Tech.ChEMBL_966605 (CHEMBL2399639)
IC50 0.900000±n/a nM
Citation Ohtawa, MYamazaki, HOhte, SMatsuda, DOhshiro, TRudel, LLOmura, STomoda, HNagamitsu, T Synthesis and structure-activity relationship of pyripyropene A derivatives as potent and selective acyl-CoA:cholesterol acyltransferase 2 (ACAT2) inhibitors: part 3. Bioorg Med Chem Lett23:3798-801 (2013) 
 
Sterol O-acyltransferase 2
Name:Sterol O-acyltransferase 2
Type:Enzyme
Mol. Mass.:59912.75
Organism:Homo sapiens (Human)
Description:O75908
Residue:522
BDBM50429604
NameBDBM50429604
Synonyms:CHEMBL2334539
TypeSmall organic molecule
Emp. Form.C37H38N2O10
Mol. Mass.670.705
SMILESCC(=O)OC[C@]1(C)[C@H](CC[C@@]2(C)[C@H]1C[C@H](OC(=O)c1ccc(cc1)C#N)[C@@]1(C)Oc3cc(oc(=O)c3[C@H](O)[C@H]21)-c1cccnc1)OC(C)=O