Reaction Details
TargetOrexin receptor type 2
LigandBDBM50436391
Substrate/Competitorn/a
Meas. Tech.ChEMBL_967231 (CHEMBL2400168)
IC50 1.000000±n/a nM
Citation Sifferlen, TKoberstein, RCottreel, EBoller, AWeller, TGatfield, JBrisbare-Roch, CJenck, FBoss, C Structure-activity relationship studies and sleep-promoting activity of novel 1-chloro-5,6,7,8-tetrahydroimidazo[1,5-a]pyrazine derivatives as dual orexin receptor antagonists. Part 2. Bioorg Med Chem Lett23:3857-63 (2013) 
 
Orexin receptor type 2
Name:Orexin receptor type 2
Type:Protein
Mol. Mass.:50710.53
Organism:Homo sapiens (Human)
Description:O43614
Residue:444
BDBM50436391
NameBDBM50436391
Synonyms:CHEMBL2396865
TypeSmall organic molecule
Emp. Form.C26H29ClF2N4O2
Mol. Mass.502.984
SMILESCCc1nc(Cl)c2[C@H](CCc3ccc(OC(F)F)cc3)N(CCn12)[C@@H](C(=O)NC)c1ccccc1