Reaction Details
TargetOrexin receptor type 2
LigandBDBM50292929
Substrate/Competitorn/a
Meas. Tech.ChEMBL_967231 (CHEMBL2400168)
IC50 8.0±n/a nM
Citation Sifferlen, TKoberstein, RCottreel, EBoller, AWeller, TGatfield, JBrisbare-Roch, CJenck, FBoss, C Structure-activity relationship studies and sleep-promoting activity of novel 1-chloro-5,6,7,8-tetrahydroimidazo[1,5-a]pyrazine derivatives as dual orexin receptor antagonists. Part 2. Bioorg Med Chem Lett23:3857-63 (2013) 
 
Orexin receptor type 2
Name:Orexin receptor type 2
Type:Protein
Mol. Mass.:50710.53
Organism:Homo sapiens (Human)
Description:O43614
Residue:444
BDBM50292929
NameBDBM50292929
Synonyms:CHEMBL455136 | almorexant
TypeSmall organic molecule
Emp. Form.C29H31F3N2O3
Mol. Mass.512.5632
SMILESCNC(=O)[C@H](N1CCc2cc(OC)c(OC)cc2[C@@H]1CCc1ccc(cc1)C(F)(F)F)c1ccccc1