Reaction Details
TargetCytochrome P450 3A4
LigandBDBM50005006
Substrate/Competitorn/a
Meas. Tech.ChEMBL_966467 (CHEMBL2399055)
IC50 980±n/a nM
Citation Décor, AGrand-Maître, CHucke, OO'Meara, JKuhn, CConstantineau-Forget, LBrochu, CMalenfant, EBertrand-Laperle, MBordeleau, JGhiro, EPesant, MFazal, GGorys, VLittle, MBoucher, CBordeleau, STurcotte, PGuo, TGarneau, MSpickler, CGauthier, A Design, synthesis and biological evaluation of novel aminothiazoles as antiviral compounds acting against human rhinovirus. Bioorg Med Chem Lett23:3841-7 (2013) 
 
Cytochrome P450 3A4
Name:Cytochrome P450 3A4
Type:Enzyme
Mol. Mass.:57349.57
Organism:Homo sapiens (Human)
Description:n/a
Residue:503
BDBM50005006
NameBDBM50005006
Synonyms:CHEMBL2397307
TypeSmall organic molecule
Emp. Form.C22H22N4O2S
Mol. Mass.406.501
SMILESCC(=O)N1[C@@H](CC[C@@H]1c1ccccc1)C(=O)Nc1ncc(s1)-c1ccc(N)cc1