Reaction Details
TargetPhosphatidylinositol 4-kinase beta
LigandBDBM50005011
Substrate/Competitorn/a
Meas. Tech.ChEMBL_966466 (CHEMBL2399054)
IC50 100±n/a nM
Citation Décor, AGrand-Maître, CHucke, OO'Meara, JKuhn, CConstantineau-Forget, LBrochu, CMalenfant, EBertrand-Laperle, MBordeleau, JGhiro, EPesant, MFazal, GGorys, VLittle, MBoucher, CBordeleau, STurcotte, PGuo, TGarneau, MSpickler, CGauthier, A Design, synthesis and biological evaluation of novel aminothiazoles as antiviral compounds acting against human rhinovirus. Bioorg Med Chem Lett23:3841-7 (2013) 
 
Phosphatidylinositol 4-kinase beta
Name:Phosphatidylinositol 4-kinase beta
Type:Protein
Mol. Mass.:91373.30
Organism:Homo sapiens (Human)
Description:n/a
Residue:816
BDBM50005011
NameBDBM50005011
Synonyms:CHEMBL2397303
TypeSmall organic molecule
Emp. Form.C24H21N5O2S
Mol. Mass.443.521
SMILESNc1ccc(cc1)-c1cnc(NC(=O)CN(Cc2ccccc2)C(=O)c2ccncc2)s1