Reaction Details
TargetCytochrome P450 3A4
LigandBDBM50005007
Substrate/Competitorn/a
Meas. Tech.ChEMBL_966467 (CHEMBL2399055)
IC50>30000±n/a nM
Citation Décor, AGrand-Maître, CHucke, OO'Meara, JKuhn, CConstantineau-Forget, LBrochu, CMalenfant, EBertrand-Laperle, MBordeleau, JGhiro, EPesant, MFazal, GGorys, VLittle, MBoucher, CBordeleau, STurcotte, PGuo, TGarneau, MSpickler, CGauthier, A Design, synthesis and biological evaluation of novel aminothiazoles as antiviral compounds acting against human rhinovirus. Bioorg Med Chem Lett23:3841-7 (2013) 
 
Cytochrome P450 3A4
Name:Cytochrome P450 3A4
Type:Enzyme
Mol. Mass.:57349.57
Organism:Homo sapiens (Human)
Description:n/a
Residue:503
BDBM50005007
NameBDBM50005007
Synonyms:CHEMBL2397310
TypeSmall organic molecule
Emp. Form.C17H19F3N4OS
Mol. Mass.384.419
SMILESCc1nc(NC(=O)[C@H]2CC[C@H](CC2)C(F)(F)F)sc1-c1ccc(N)nc1