Reaction Details
TargetRibosomal protein S6 kinase alpha-4
LigandBDBM50436476
Substrate/Competitorn/a
Meas. Tech.ChEMBL_966443 (CHEMBL2399031)
IC50 4600±n/a nM
Citation Décor, AGrand-Maître, CHucke, OO'Meara, JKuhn, CConstantineau-Forget, LBrochu, CMalenfant, EBertrand-Laperle, MBordeleau, JGhiro, EPesant, MFazal, GGorys, VLittle, MBoucher, CBordeleau, STurcotte, PGuo, TGarneau, MSpickler, CGauthier, A Design, synthesis and biological evaluation of novel aminothiazoles as antiviral compounds acting against human rhinovirus. Bioorg Med Chem Lett23:3841-7 (2013) 
 
Ribosomal protein S6 kinase alpha-4
Name:Ribosomal protein S6 kinase alpha-4
Type:Serine/threonine-protein kinase
Mol. Mass.:85620.38
Organism:Homo sapiens (Human)
Description:Recombinant MSK2 was phosphorylated by incubation with active p38alpha before assays.
Residue:772
BDBM50436476
NameBDBM50436476
Synonyms:CHEMBL2397316
TypeSmall organic molecule
Emp. Form.C15H17F3N4OS
Mol. Mass.358.382
SMILESCc1nc(NC(=O)C(C)(C)CC(F)(F)F)sc1-c1ccc(N)nc1