Reaction Details
TargetSerine/threonine-protein kinase 17A
LigandBDBM50436478
Substrate/Competitorn/a
Meas. Tech.ChEMBL_966451 (CHEMBL2399039)
IC50 2900±n/a nM
Citation Décor, AGrand-Maître, CHucke, OO'Meara, JKuhn, CConstantineau-Forget, LBrochu, CMalenfant, EBertrand-Laperle, MBordeleau, JGhiro, EPesant, MFazal, GGorys, VLittle, MBoucher, CBordeleau, STurcotte, PGuo, TGarneau, MSpickler, CGauthier, A Design, synthesis and biological evaluation of novel aminothiazoles as antiviral compounds acting against human rhinovirus. Bioorg Med Chem Lett23:3841-7 (2013) 
 
Serine/threonine-protein kinase 17A
Name:Serine/threonine-protein kinase 17A
Type:Enzyme Catalytic Domain
Mol. Mass.:46544.04
Organism:Homo sapiens (Human)
Description:gi_109255245
Residue:414
BDBM50436478
NameBDBM50436478
Synonyms:CHEMBL2397314
TypeSmall organic molecule
Emp. Form.C14H15F3N4OS
Mol. Mass.344.355
SMILESC[C@H](CC(F)(F)F)C(=O)Nc1nc(C)c(s1)-c1ccc(N)nc1