Reaction Details
TargetCytochrome P450 2D6
LigandBDBM50436479
Substrate/Competitorn/a
Meas. Tech.ChEMBL_966468 (CHEMBL2399056)
IC50>30000±n/a nM
Citation Décor, AGrand-Maître, CHucke, OO'Meara, JKuhn, CConstantineau-Forget, LBrochu, CMalenfant, EBertrand-Laperle, MBordeleau, JGhiro, EPesant, MFazal, GGorys, VLittle, MBoucher, CBordeleau, STurcotte, PGuo, TGarneau, MSpickler, CGauthier, A Design, synthesis and biological evaluation of novel aminothiazoles as antiviral compounds acting against human rhinovirus. Bioorg Med Chem Lett23:3841-7 (2013) 
 
Cytochrome P450 2D6
Name:Cytochrome P450 2D6
Type:Protein
Mol. Mass.:55774.82
Organism:Homo sapiens (Human)
Description:P10635
Residue:497
BDBM50436479
NameBDBM50436479
Synonyms:CHEMBL2397308
TypeSmall organic molecule
Emp. Form.C25H23N5O2S
Mol. Mass.457.547
SMILESCc1ccc(cn1)C(=O)N(CC(=O)Nc1ncc(s1)-c1ccc(N)cc1)Cc1ccccc1