Reaction Details
TargetGenome polyprotein
LigandBDBM50436488
Substrate/Competitorn/a
Meas. Tech.ChEMBL_966615 (CHEMBL2399649)
IC50 1800±n/a nM
Citation Mandadapu, SRWeerawarna, PMPrior, AMUy, RAAravapalli, SAlliston, KRLushington, GHKim, YHua, DHChang, KOGroutas, WC Macrocyclic inhibitors of 3C and 3C-like proteases of picornavirus, norovirus, and coronavirus. Bioorg Med Chem Lett23:3709-12 (2013) 
 
Genome polyprotein
Name:Genome polyprotein
Type:Enzyme
Mol. Mass.:243464.96
Organism:Coxsackievirus B3 (strain Nancy)
Description:P03313
Residue:2185
BDBM50436488
NameBDBM50436488
Synonyms:CHEMBL2397338
TypeSmall organic molecule
Emp. Form.C27H37N7O6
Mol. Mass.555.626
SMILESCC(C)C[C@@H]1NC(=O)[C@H](Cc2cn(CCCNC(=O)CC[C@H](NC1=O)C=O)nn2)NC(=O)OCc1ccccc1